{"text_format":"1","workbook":"xlsx","n_sheets":6,"sheets":["Contributory Factors","Countermeasures","Recommendations_Printable","Sheet3","Recommendations","Transpose For Lists"],"not_rendered":{"charts":0,"images":128,"macros":1,"external_links":0,"defined_names":2,"comments":0,"pivot_tables":0},"unopened":[],"bounds":{"document_bytes":16777216,"sheet_cells":100000,"rows_first":2000,"rows_last":500,"rows_between":2000,"halvings":0,"cell_chars":16384,"cell_head_chars":4096},"cells_cut":0,"cells_raw":0,"read":"whole","date_system":"1900"}

{"sheet":"Contributory Factors","index":0,"n_rows":0,"n_cols":0,"rows_kept":0,"cut":false,"hidden":false,"merged":[]}

{"sheet":"Countermeasures","index":1,"n_rows":0,"n_cols":0,"rows_kept":0,"cut":false,"hidden":false,"merged":[]}

{"sheet":"Recommendations_Printable","index":2,"n_rows":124,"n_cols":4,"rows_kept":124,"cut":false,"hidden":false,"merged":[[0,0,0,3]]}
["Recommendations"]
[null,null,"Date of Asssessment:","dd/mm/yyyy"]
[null,null,"Assessed by:","Please enter name"]
[null,null,"Organisation:","Please enter organisation"]
[null,null,"Assessed Area:","Please enter area under assessment"]
[null,null,"RoR Crash Type:","All RoR"]
[]
["Priority","#","Contributory Factor","Recommended Countermeasures to be Considered"]
[1,1,"Data on (RoR) crashes aren't collected"]
[1,null,1,"Introduce RoR specific data fields to national incident data collection forms."]
{"$rows_left_out":115}
{"sheet":"Sheet3","index":3,"n_rows":35,"n_cols":23,"rows_kept":35,"cut":false,"hidden":true,"merged":[]}
["Button number","Button text","Risk (0 Empty, 1 Low, 2 Med, 3 High)","# of CM applied","Priority (4 = Very High, 3= High, 2 = Medium, 1 = Low)","Countermeasure 1","Countermeasure 2","Countermeasure 3","Countermeasure 4","Countermeasure 5","Countermeasure 6","CM1 Y/N?","CM2 Y/N?","CM3 Y/N?","CM4 Y/N?","CM5 Y/N?","CM6 Y/N?",null,null,null,null,"Date of Asssessment:","dd/mm/yyyy"]
[2,"Data on (RoR) crashes aren't collected",0,{"$f":"SUM(L2:Q2)","v":0},{"$f":"IF((C2=3)*AND(D2=0),1,(IF((C2=3)*AND(D2=1),2,(IF((C2=3)*AND(D2>1),3,(IF((C2=2)*AND(D2=0),2,(IF((C2=2)*AND(D2=1),3,(IF((C2=2)*AND(D2>1),3,4)))))))))))","v":4},"Introduce RoR specific data fields to national incident data collection forms.","Introduce legal requirement for collection of RoR incident data at national level.","Incentivise collection of RoR incident data, by raising awareness to the benefits amongst traffic police.","Create centralised database for RSA findings.","Create centralised database for RSI findings.","Create centralised data base for roadside related departures from standards.",0,0,0,0,0,0,null,null,null,null,"Assessed by:","Please enter name"]
[3,"Data on (RoR) crashes aren't detailed enough",0,0,{"$f":"IF((C3=3)*AND(D3=0),1,(IF((C3=3)*AND(D3=1),2,(IF((C3=3)*AND(D3>1),3,(IF((C3=2)*AND(D3=0),2,(IF((C3=2)*AND(D3=1),3,(IF((C3=2)*AND(D3>1),3,4)))))))))))","v":4},"Establish in-depth on site incident data collection programme, such as RAIDS in the UK.","Introduce site photographs as part of national incident data collection procedure. ","Introduce sketch of the incident as part of national incident data collection form.","Introduce detailed written description of the incident as part of national data collection form.","Introduce data fields into national incident data collection form, which describe objects hit off carriageway.","Regularly review and improve the national incident data collection form.",0,0,0,0,0,0,null,null,null,null,"Organisation:","Please enter organisation"]
[4,"Data on (RoR) crashes aren't reviewed",0,0,4,"Regularly (ex. annually) review incident statistics to identify RoR issues.","Regularly (ex. annually) review RSI findings to identify roadside safety issues.","Regularly (ex. annually) review RSA findings to identify roadside safety issues.","Regularly (ex. annually) review departures from standards to identify common  issues.","Regularly (ex. annually) review in-depth on site incident data to identify RoR issues.","Other",0,0,0,0,0,0,null,null,null,null,"Assessed Area:","Please enter area under assessment"]
[5,"Roadside Design Standard is out of date",0,0,4,"Regularly (ex. annually) review roadside design standards to ensure consistency with other relevant design standards.","Regularly (ex. annually) review roadside design standards to ensure identified issues are covered.","Other",null,null,null,0,0,0,0,0,0,null,null,null,null,"RoR Crash Type:","All RoR"]
[6,"There is no solution available for some issues",0,0,4,"Undertake research programmes to develop bespoke solutions.","Review international best practice to identify potential solutions.","Regularly raise identified issues at relevant national and European Standards Committees to support development of solutions. ","Other",null,null,0,0,0,0,0,0]
[7,"Some road users are not considered in the design standard",0,0,4,"Ensure all requirements within the roadside design standard take powered two wheelers into consideration","Ensure all requirements within the roadside design standard take cyclists into consideration","Ensure all requirements within the roadside design standard take pedestrians into consideration","Ensure all requirements within the roadside design standard take heavy vehicles  into consideration","Other",null,0,0,0,0,0,0]
[8,"Some site constraints are not considered in the design standard",0,0,4,"Ensure soil and foundation conditions are considered within the roadside design manual","Introduce requirements to ensure VRS are installed on as-tested soil conditions.","Introduce BIM Level 2 approach so more information about the roadside, including all infrastructure in the vicinity are available at the design stage.","Ensure installations on roadside surfaces (such as kerbs) take effective barrier height into consideration.","Other",null,0,0,0,0,0,0]
[9,"Some VRS product constraints are not considered in the design standard",0,0,4,"Introduce requirements to ensure VRS tested length are taken into consideration","Introduce requirements to ensure availability of approved transitions are taken into consideration","Introduce requirements to ensure availability of approved terminals are taken into consideration","Introduce requirements to ensure durability of VRS are taken into consideration, in relation to local climate","Introduce requirement to ensure vehicle intrusion is taken into consideration","Other",0,0,0,0,0,0]
[10,"Combined (negative) effects of standards aren't considered",0,0,4,"Other",null,null,null,null,null,0,0,0,0,0,0]
{"$rows_left_out":26}
{"sheet":"Recommendations","index":4,"n_rows":36,"n_cols":12,"rows_kept":36,"cut":false,"hidden":true,"merged":[[0,1,1,1],[0,0,1,0],[0,6,0,11],[0,4,1,4],[0,5,1,5],[0,3,1,3],[0,2,1,2]]}
["Button no","Problem","Priority (0 Empty, 1 Low, 2 Med, 3 High)","# of Countermeasures applied","Priority (4 = Very High, 3= High, 2 = Medium, 1 = Low)","CM Use","Recommended alternative countermeasures"]
[null,null,null,null,null,null,1,2,3,4,5,6]
[2,"Data on (RoR) crashes aren't collected",{"$f":"Sheet3!C2","v":0},{"$f":"Sheet3!D2","v":0},{"$f":"IF((C3=3)*AND(D3=0),1,(IF((C3=3)*AND(D3=1),2,(IF((C3=3)*AND(D3>1),3,(IF((C3=2)*AND(D3=0),2,(IF((C3=2)*AND(D3=1),3,(IF((C3=2)*AND(D3>1),3,4)))))))))))","v":4},null,{"$f":"IF(Sheet3!L2=0,Sheet3!F2,\"\")","v":"Introduce RoR specific data fields to national incident data collection forms."},{"$f":"IF(Sheet3!M2=0,Sheet3!G2,\"\")","v":"Introduce legal requirement for collection of RoR incident data at national level."},{"$f":"IF(Sheet3!N2=0,Sheet3!H2,\"\")","v":"Incentivise collection of RoR incident data, by raising awareness to the benefits amongst traffic police."},{"$f":"IF(Sheet3!O2=0,Sheet3!I2,\"\")","v":"Create centralised database for RSA findings."},{"$f":"IF(Sheet3!P2=0,Sheet3!J2,\"\")","v":"Create centralised database for RSI findings."},{"$f":"IF(Sheet3!Q2=0,Sheet3!K2,\"\")","v":"Create centralised data base for roadside related departures from standards."}]
[3,"Data on (RoR) crashes aren't detailed enough",{"$f":"Sheet3!C3","v":0},{"$f":"Sheet3!D3","v":0},4,null,{"$f":"IF(Sheet3!L3=0,Sheet3!F3,\"\")","v":"Establish in-depth on site incident data collection programme, such as RAIDS in the UK."},{"$f":"IF(Sheet3!M3=0,Sheet3!G3,\"\")","v":"Introduce site photographs as part of national incident data collection procedure. "},{"$f":"IF(Sheet3!N3=0,Sheet3!H3,\"\")","v":"Introduce sketch of the incident as part of national incident data collection form."},{"$f":"IF(Sheet3!O3=0,Sheet3!I3,\"\")","v":"Introduce detailed written description of the incident as part of national data collection form."},{"$f":"IF(Sheet3!P3=0,Sheet3!J3,\"\")","v":"Introduce data fields into national incident data collection form, which describe objects hit off carriageway."},{"$f":"IF(Sheet3!Q3=0,Sheet3!K3,\"\")","v":"Regularly review and improve the national incident data collection form."}]
[4,"Data pon (RoR) crashes aren't reviewed",{"$f":"Sheet3!C4","v":0},{"$f":"Sheet3!D4","v":0},4,null,{"$f":"IF(Sheet3!L4=0,Sheet3!F4,\"\")","v":"Regularly (ex. annually) review incident statistics to identify RoR issues."},{"$f":"IF(Sheet3!M4=0,Sheet3!G4,\"\")","v":"Regularly (ex. annually) review RSI findings to identify roadside safety issues."},{"$f":"IF(Sheet3!N4=0,Sheet3!H4,\"\")","v":"Regularly (ex. annually) review RSA findings to identify roadside safety issues."},{"$f":"IF(Sheet3!O4=0,Sheet3!I4,\"\")","v":"Regularly (ex. annually) review departures from standards to identify common  issues."},{"$f":"IF(Sheet3!P4=0,Sheet3!J4,\"\")","v":"Regularly (ex. annually) review in-depth on site incident data to identify RoR issues."},{"$f":"IF(Sheet3!Q4=0,Sheet3!K4,\"\")","v":"Other"}]
[5,"Roadside Design Standard is out of date",{"$f":"Sheet3!C5","v":0},{"$f":"Sheet3!D5","v":0},4,null,{"$f":"IF(Sheet3!L5=0,Sheet3!F5,\"\")","v":"Regularly (ex. annually) review roadside design standards to ensure consistency with other relevant design standards."},{"$f":"IF(Sheet3!M5=0,Sheet3!G5,\"\")","v":"Regularly (ex. annually) review roadside design standards to ensure identified issues are covered."},{"$f":"IF(Sheet3!N5=0,Sheet3!H5,\"\")","v":"Other"},{"$f":"IF(Sheet3!O5=0,Sheet3!I5,\"\")","v":0},{"$f":"IF(Sheet3!P5=0,Sheet3!J5,\"\")","v":0},{"$f":"IF(Sheet3!Q5=0,Sheet3!K5,\"\")","v":0}]
[6,"There is no solution available for some issues",{"$f":"Sheet3!C6","v":0},{"$f":"Sheet3!D6","v":0},4,null,{"$f":"IF(Sheet3!L6=0,Sheet3!F6,\"\")","v":"Undertake research programmes to develop bespoke solutions."},{"$f":"IF(Sheet3!M6=0,Sheet3!G6,\"\")","v":"Review international best practice to identify potential solutions."},{"$f":"IF(Sheet3!N6=0,Sheet3!H6,\"\")","v":"Regularly raise identified issues at relevant national and European Standards Committees to support development of solutions. "},{"$f":"IF(Sheet3!O6=0,Sheet3!I6,\"\")","v":"Other"},{"$f":"IF(Sheet3!P6=0,Sheet3!J6,\"\")","v":0},{"$f":"IF(Sheet3!Q6=0,Sheet3!K6,\"\")","v":0}]
[7,"Some road users are not considered in the design standard",{"$f":"Sheet3!C7","v":0},{"$f":"Sheet3!D7","v":0},4,null,{"$f":"IF(Sheet3!L7=0,Sheet3!F7,\"\")","v":"Ensure all requirements within the roadside design standard take powered two wheelers into consideration"},{"$f":"IF(Sheet3!M7=0,Sheet3!G7,\"\")","v":"Ensure all requirements within the roadside design standard take cyclists into consideration"},{"$f":"IF(Sheet3!N7=0,Sheet3!H7,\"\")","v":"Ensure all requirements within the roadside design standard take pedestrians into consideration"},{"$f":"IF(Sheet3!O7=0,Sheet3!I7,\"\")","v":"Ensure all requirements within the roadside design standard take heavy vehicles  into consideration"},{"$f":"IF(Sheet3!P7=0,Sheet3!J7,\"\")","v":"Other"},{"$f":"IF(Sheet3!Q7=0,Sheet3!K7,\"\")","v":0}]
[8,"Some site constraints are not considered in the design standard",{"$f":"Sheet3!C8","v":0},{"$f":"Sheet3!D8","v":0},4,null,{"$f":"IF(Sheet3!L8=0,Sheet3!F8,\"\")","v":"Ensure soil and foundation conditions are considered within the roadside design manual"},{"$f":"IF(Sheet3!M8=0,Sheet3!G8,\"\")","v":"Introduce requirements to ensure VRS are installed on as-tested soil conditions."},{"$f":"IF(Sheet3!N8=0,Sheet3!H8,\"\")","v":"Introduce BIM Level 2 approach so more information about the roadside, including all infrastructure in the vicinity are available at the design stage."},{"$f":"IF(Sheet3!O8=0,Sheet3!I8,\"\")","v":"Ensure installations on roadside surfaces (such as kerbs) take effective barrier height into consideration."},{"$f":"IF(Sheet3!P8=0,Sheet3!J8,\"\")","v":"Other"},{"$f":"IF(Sheet3!Q8=0,Sheet3!K8,\"\")","v":0}]
[9,"Some VRS product constraints are not considered in the design standard",{"$f":"Sheet3!C9","v":0},{"$f":"Sheet3!D9","v":0},4,null,{"$f":"IF(Sheet3!L9=0,Sheet3!F9,\"\")","v":"Introduce requirements to ensure VRS tested length are taken into consideration"},{"$f":"IF(Sheet3!M9=0,Sheet3!G9,\"\")","v":"Introduce requirements to ensure availability of approved transitions are taken into consideration"},{"$f":"IF(Sheet3!N9=0,Sheet3!H9,\"\")","v":"Introduce requirements to ensure availability of approved terminals are taken into consideration"},{"$f":"IF(Sheet3!O9=0,Sheet3!I9,\"\")","v":"Introduce requirements to ensure durability of VRS are taken into consideration, in relation to local climate"},{"$f":"IF(Sheet3!P9=0,Sheet3!J9,\"\")","v":"Introduce requirement to ensure vehicle intrusion is taken into consideration"},{"$f":"IF(Sheet3!Q9=0,Sheet3!K9,\"\")","v":"Other"}]
{"$rows_left_out":27}
{"sheet":"Transpose For Lists","index":5,"n_rows":8,"n_cols":39,"rows_kept":8,"cut":false,"hidden":true,"merged":[]}
["Button No",2,3,4,5,6,7,8,9,10,11,12,13,14,15,16,17,18,19,20,21,22,23,24,25,26,27,28,29,30,31,32,33,34,35,36,37,38,39]
["Contributory Factor",{"$f":"TRANSPOSE(Sheet3!B2:B35)","v":"Data on (RoR) crashes aren't collected"},"Data on (RoR) crashes aren't detailed enough","Data on (RoR) crashes aren't reviewed","Roadside Design Standard is out of date","There is no solution available for some issues","Some road users are not considered in the design standard","Some site constraints are not considered in the design standard","Some VRS product constraints are not considered in the design standard","Combined (negative) effects of standards aren't considered","Design standard is not followed (user errors)","Insufficient internal design checks / peer review / risk and value analysis","Departures from Standard due to Site constraints","Departures from Standard due to Product Availability ","Departures from Standard due to Budget Constraints","Design is not subject to RSA","Problem is not identified during RSA","Recommendations from RSA are discarded / ignored","Implementation errors","Products provided on site are not the same as tested (material/design)","Inadequate contract specifications and incentives","Insufficient site supervision","Implementation is not subject to RSA","Problem is not identified during RSA","Recommendations from RSA are discarded / ignored","Durability issues (corrosion, loose bolts, etc.)","Road environment changes (vegetation, erosion, new asphalt layer, etc.)","Previous impact damage","Changes to road and traffic conditions (speed limit, ADT, HGV%, new lanes)","Vehicle fleet changes (increased mass, SUVs, etc.)","Inadequate maintenance plan","RSI is not carried out","Problem occurred after last RSI","Problem is not identified during RSI","Problem identified in RSI is not fixed",{"$error":"#N/A"},{"$error":"#N/A"},{"$error":"#N/A"},{"$error":"#N/A"}]
["Counter Measure 1",{"$f":"TRANSPOSE(Sheet3!F2:K35)","v":"Introduce RoR specific data fields to national incident data collection forms."},"Establish in-depth on site incident data collection programme, such as RAIDS in the UK.","Regularly (ex. annually) review incident statistics to identify RoR issues.","Regularly (ex. annually) review roadside design standards to ensure consistency with other relevant design standards.","Undertake research programmes to develop bespoke solutions.","Ensure all requirements within the roadside design standard take powered two wheelers into consideration","Ensure soil and foundation conditions are considered within the roadside design manual","Introduce requirements to ensure VRS tested length are taken into consideration","Other","Provide sufficient applied examples in the design guide / manual","Other","Create centralised data base for roadside related departures from standards.","Create centralised data base for roadside related departures from standards.","Create centralised data base for roadside related departures from standards.","Introduce requirement for mandatory design stage road safety audit process","Introduce guidelines for RSAs to take common issues relating to the latest roadside safety requirements into account ","Other","Introduce a mandatory training and certification programme for roadside infrastructure installers","Introduce procedure for sampling and testing of material delivered on site","Other","Other","Introduce requirement for mandatory implementation stage road safety audit process","Introduce guidelines for RSAs to take common issues relating to the latest roadside safety requirements into account ","Other","Carry out regular road safety inspections","Carry out regular road safety inspections","Carry out regular road safety inspections","Ensure there is a mandatory reassessment of roadside design when the speed limit is increased","Regularly review vehicle fleet composition and assess its effects on VRS","Other","Introduce mandatory road safety inspections","Increase frequency of road safety inspections","Introduce guidelines for RSIs to take common issues relating to roadside safety into account ","Other"]
["Counter Measure 2","Introduce legal requirement for collection of RoR incident data at national level.","Introduce site photographs as part of national incident data collection procedure. ","Regularly (ex. annually) review RSI findings to identify roadside safety issues.","Regularly (ex. annually) review roadside design standards to ensure identified issues are covered.","Review international best practice to identify potential solutions.","Ensure all requirements within the roadside design standard take cyclists into consideration","Introduce requirements to ensure VRS are installed on as-tested soil conditions.","Introduce requirements to ensure availability of approved transitions are taken into consideration",0,"Introduce a mandatory training programme for designers",0,"Regularly (ex. annually) review departures from standards to identify common  issues.","Regularly (ex. annually) review departures from standards to identify common  issues.","Regularly (ex. annually) review departures from standards to identify common  issues.","Introduce requirements to ensure a design cannot proceed to implementation without RSA","Introduce training for road safety auditors in issues specific to road side safety design",0,"Ensure infrastructure installers are qualified to the necessary standards","Introduce factory production control requirement for non-harmonised VRS products",0,0,"Other","Introduce training for road safety auditors in issues specific to road side safety design",0,"Consider prioritising VRS with better durability","Other","Establish a system through which public can report damage and defects","Ensure there is a mandatory reassessment of roadside design when lane layouts are changed","Incentivise VRS manufacturers to develop systems which are compatible with modern vehicle types such as SUVs",0,"Other","Other","Introduce training for road safety inspectors in issues specific to road side safety"]
["Counter Measure 3","Incentivise collection of RoR incident data, by raising awareness to the benefits amongst traffic police.","Introduce sketch of the incident as part of national incident data collection form.","Regularly (ex. annually) review RSA findings to identify roadside safety issues.","Other","Regularly raise identified issues at relevant national and European Standards Committees to support development of solutions. ","Ensure all requirements within the roadside design standard take pedestrians into consideration","Introduce BIM Level 2 approach so more information about the roadside, including all infrastructure in the vicinity are available at the design stage.","Introduce requirements to ensure availability of approved terminals are taken into consideration",0,"Introduce mandatory road safety audit process at design stages",0,"Adjust the design standard accordingly to take recurring, common departures into account","Work with industry to incentivise development of commonly needed products, such as transitions","Adjust the design standard accordingly to take recurring, common departures into account","Other","Ensure road safety auditors are qualified to the necessary standards",0,"Introduce a procedure to enable reporting of cases where installers arrive to a site which isn't as described in the design","Other",0,0,0,"Ensure road safety auditors are qualified to the necessary standards",0,"Establish asset management system to manage VRS maintenance",0,"Consider prioritising VRS which can withstand consecutive impacts without need for repair","Create a database of traffic conditions at the time of roadside design and regularly review with current traffic conditions","Update European VRS standards to ensure impact test vehicles are representative of modern fleet",0,0,0,"Ensure road safety inspectors are qualified to the necessary standards"]
["Counter Measure 4","Create centralised database for RSA findings.","Introduce detailed written description of the incident as part of national data collection form.","Regularly (ex. annually) review departures from standards to identify common  issues.",0,"Other","Ensure all requirements within the roadside design standard take heavy vehicles  into consideration","Ensure installations on roadside surfaces (such as kerbs) take effective barrier height into consideration.","Introduce requirements to ensure durability of VRS are taken into consideration, in relation to local climate",0,"Other",0,"Other","Other","Report recurring departures to upper management with justification / data for further budget allocation.",0,"Other",0,"Other",0,0,0,0,"Other",0,"Other",0,"Other","Other","Monitor performance of historic VRS for real world impacts by modern vehicles",0,0,0,"Ensure multiple road safety inspectors are assigned for each inspection"]
["Counter Measure 5","Create centralised database for RSI findings.","Introduce data fields into national incident data collection form, which describe objects hit off carriageway.","Regularly (ex. annually) review in-depth on site incident data to identify RoR issues.",0,0,"Other","Other","Introduce requirement to ensure vehicle intrusion is taken into consideration",0,0,0,0,0,"Other",0,0,0,0,0,0,0,0,0,0,0,0,0,0,"Other",0,0,0,"Other"]
["Counter Measure 6","Create centralised data base for roadside related departures from standards.","Regularly review and improve the national incident data collection form.","Other",0,0,0,0,"Other",0,0,0,0,0,0,0,0,0,0,0,0,0,0,0,0,0,0,0,0,0,0,0,0,0]